Target
Sigma intracellular receptor 2
Ligand
BDBM50370517
Substrate
Meas. Tech.
TBD
Ki
553±n/a nM
Citation
 Martin, SFSahn, JJLinkens, KT Sigma receptor binders US Patent  US10954217 Publication Date 3/23/2021 
Target
Name:
Sigma intracellular receptor 2
Synonyms:
MAC30 S2R Sigma-2 receptor TMEM97 | Transmembrane protein 97
Type:
Protein
Mol. Mass.:
20857.20
Organism:
Homo sapiens (Human)
Description:
Q5BJF2
Residue:
176
  
Inhibitor
Name:
BDBM50370517
Synonyms:
CHEMBL4163428 | US10954217, Example 00227
Type:
Small organic molecule
Emp. Form.:
C21H25N3O2
Mol. Mass.:
351.4421
SMILES:
CN1CCN(CC1)c1ccc2CN(Cc2c1)C(=O)OCc1ccccc1
: