Target
Sigma intracellular receptor 2
Ligand
BDBM50370518
Substrate
Meas. Tech.
TBD
Ki
8.20±n/a nM
Citation
 Martin, SFSahn, JJLinkens, KT Sigma receptor binders US Patent  US10954217 Publication Date 3/23/2021 
Target
Name:
Sigma intracellular receptor 2
Synonyms:
MAC30 S2R Sigma-2 receptor TMEM97 | Transmembrane protein 97
Type:
Protein
Mol. Mass.:
20857.20
Organism:
Homo sapiens (Human)
Description:
Q5BJF2
Residue:
176
  
Inhibitor
Name:
BDBM50370518
Synonyms:
CHEMBL4176474 | US10954217, Example 00229
Type:
Small organic molecule
Emp. Form.:
C25H31N3O2
Mol. Mass.:
405.5325
SMILES:
O=C(OCc1ccccc1)N1Cc2ccc(cc2C1)N1CCN(CC1)C1CCCC1
: