Target
Sigma intracellular receptor 2
Ligand
BDBM50370624
Substrate
Meas. Tech.
TBD
Ki
33.0±n/a nM
Citation
 Martin, SFSahn, JJLinkens, KT Sigma receptor binders US Patent  US10954217 Publication Date 3/23/2021 
Target
Name:
Sigma intracellular receptor 2
Synonyms:
MAC30 S2R Sigma-2 receptor TMEM97 | Transmembrane protein 97
Type:
Protein
Mol. Mass.:
20857.20
Organism:
Homo sapiens (Human)
Description:
Q5BJF2
Residue:
176
  
Inhibitor
Name:
BDBM50370624
Synonyms:
CHEMBL4169752 | US10954217, Example 00234
Type:
Small organic molecule
Emp. Form.:
C20H24N2O
Mol. Mass.:
308.4174
SMILES:
C(N1CCc2cc(ccc2C1)N1CCOCC1)c1ccccc1
: