Target
Sigma non-opioid intracellular receptor 1
Ligand
BDBM50370623
Substrate
Meas. Tech.
TBD
Ki
51.0±n/a nM
Citation
 Martin, SFSahn, JJLinkens, KT Sigma receptor binders US Patent  US10954217 Publication Date 3/23/2021 
Target
Name:
Sigma non-opioid intracellular receptor 1
Synonyms:
Aging-associated gene 8 protein SGMR1_HUMAN SIGMAR1 SR31747-binding protein Sigma 1-type opioid receptor Sigma1R | hSigmaR1
Type:
Enzyme Catalytic Domain
Mol. Mass.:
25124.85
Organism:
Homo sapiens (Human)
Description:
Q99720
Residue:
223
  
Inhibitor
Name:
BDBM50370623
Synonyms:
CHEMBL4165863 | US10954217, Example 00237
Type:
Small organic molecule
Emp. Form.:
C26H33N3O2
Mol. Mass.:
419.5591
SMILES:
O=C(OCc1ccccc1)N1CCc2ccc(cc2C1)N1CCN(CC1)C1CCCC1
: