Target
Sigma non-opioid intracellular receptor 1
Ligand
BDBM488134
Substrate
Meas. Tech.
TBD
Ki
35.0±n/a nM
Citation
 Martin, SFSahn, JJLinkens, KT Sigma receptor binders US Patent  US10954217 Publication Date 3/23/2021 
Target
Name:
Sigma non-opioid intracellular receptor 1
Synonyms:
Aging-associated gene 8 protein SGMR1_HUMAN SIGMAR1 SR31747-binding protein Sigma 1-type opioid receptor Sigma1R | hSigmaR1
Type:
Enzyme Catalytic Domain
Mol. Mass.:
25124.85
Organism:
Homo sapiens (Human)
Description:
Q99720
Residue:
223
  
Inhibitor
Name:
BDBM488134
Synonyms:
US10954217, Example Table 3.A16
Type:
Small organic molecule
Emp. Form.:
C27H35N3O2
Mol. Mass.:
433.5857
SMILES:
O=C(OCc1ccccc1)N1CCc2ccc(cc2C1)N1CCN(CC1)C1CCCCC1
: