Target
Sigma intracellular receptor 2
Ligand
BDBM488135
Substrate
Meas. Tech.
TBD
Ki
134±n/a nM
Citation
 Martin, SFSahn, JJLinkens, KT Sigma receptor binders US Patent  US10954217 Publication Date 3/23/2021 
Target
Name:
Sigma intracellular receptor 2
Synonyms:
MAC30 S2R Sigma-2 receptor TMEM97 | Transmembrane protein 97
Type:
Protein
Mol. Mass.:
20857.20
Organism:
Homo sapiens (Human)
Description:
Q5BJF2
Residue:
176
  
Inhibitor
Name:
BDBM488135
Synonyms:
US10954217, Example Table 3.A17
Type:
Small organic molecule
Emp. Form.:
C25H31N3O2
Mol. Mass.:
405.5325
SMILES:
CC(=C)CN1CCN(CC1)c1ccc2CN(CCc2c1)C(=O)OCc1ccccc1
: