Target
Sigma intracellular receptor 2
Ligand
BDBM50370709
Substrate
Meas. Tech.
TBD
Ki
151±n/a nM
Citation
 Martin, SFSahn, JJLinkens, KT Sigma receptor binders US Patent  US10954217 Publication Date 3/23/2021 
Target
Name:
Sigma intracellular receptor 2
Synonyms:
MAC30 S2R Sigma-2 receptor TMEM97 | Transmembrane protein 97
Type:
Protein
Mol. Mass.:
20857.20
Organism:
Homo sapiens (Human)
Description:
Q5BJF2
Residue:
176
  
Inhibitor
Name:
BDBM50370709
Synonyms:
CHEMBL4166883 | US10954217, Example 00256
Type:
Small organic molecule
Emp. Form.:
C23H29N3O2
Mol. Mass.:
379.4953
SMILES:
CN1CCN(CC1)c1ccc2CCCN(Cc2c1)C(=O)OCc1ccccc1
: