Target
Sigma intracellular receptor 2
Ligand
BDBM488158
Substrate
Meas. Tech.
TBD
Ki
52.0±n/a nM
Citation
 Martin, SFSahn, JJLinkens, KT Sigma receptor binders US Patent  US10954217 Publication Date 3/23/2021 
Target
Name:
Sigma intracellular receptor 2
Synonyms:
MAC30 S2R Sigma-2 receptor TMEM97 | Transmembrane protein 97
Type:
Protein
Mol. Mass.:
20857.20
Organism:
Homo sapiens (Human)
Description:
Q5BJF2
Residue:
176
  
Inhibitor
Name:
BDBM488158
Synonyms:
US10954217, Example Table 3.A40
Type:
Small organic molecule
Emp. Form.:
C21H25Cl2N3O2S
Mol. Mass.:
454.413
SMILES:
CN1CCN(CC1)c1ccc2CCCN(Cc2c1)S(=O)(=O)c1cc(Cl)cc(Cl)c1
: