Target
Proto-oncogene tyrosine-protein kinase receptor Ret
Ligand
BDBM488442
Substrate
Meas. Tech.
Enzyme Assay
IC50
11.1±n/a nM
Citation
 Jordan, AMNewton, RWaszkowycz, BSutton, JMHynd, GPaoletta, SFordyce, EA Heterocyclic compounds as ret kinase inhibitors US Patent  US10954241 Publication Date 3/23/2021 
Target
Name:
Proto-oncogene tyrosine-protein kinase receptor Ret
Synonyms:
CDHF12 Cadherin family member 12 Proto-oncogene c-Ret RET51 Tyrosine-protein kinase Ret (RET)
Type:
Protein
Mol. Mass.:
124318.29
Organism:
Homo sapiens (Human)
Description:
P07949
Residue:
1114
  
Inhibitor
Name:
BDBM488442
Synonyms:
N-(2-{4-Amino-1-tert-butyl-1H-pyrazolo[3,4- d]pyrimidin-3-yl}-3-chloro-1H-indol-6- yl)acetamide | US10954241, Example 82
Type:
Small organic molecule
Emp. Form.:
C19H20ClN7O
Mol. Mass.:
397.861
SMILES:
CC(=O)Nc1ccc2c(Cl)c([nH]c2c1)-c1nn(c2ncnc(N)c12)C(C)(C)C
: