Target
Proto-oncogene tyrosine-protein kinase receptor Ret
Ligand
BDBM488463
Substrate
Meas. Tech.
Enzyme Assay
IC50
8.66±n/a nM
Citation
 Jordan, AMNewton, RWaszkowycz, BSutton, JMHynd, GPaoletta, SFordyce, EA Heterocyclic compounds as ret kinase inhibitors US Patent  US10954241 Publication Date 3/23/2021 
Target
Name:
Proto-oncogene tyrosine-protein kinase receptor Ret
Synonyms:
CDHF12 Cadherin family member 12 Proto-oncogene c-Ret RET51 Tyrosine-protein kinase Ret (RET)
Type:
Protein
Mol. Mass.:
124318.29
Organism:
Homo sapiens (Human)
Description:
P07949
Residue:
1114
  
Inhibitor
Name:
BDBM488463
Synonyms:
2-[4-Amino-1-(oxan-4-yl)-1H-pyrazolo[3,4- d]pyrimidin-3-yl]-3-chloro-N-cyclopropyl-1H- indole-6-carboxamide US11548896, Example 103
Type:
Small organic molecule
Emp. Form.:
C22H22ClN7O2
Mol. Mass.:
451.909
SMILES:
Nc1ncnc2n(nc(-c3[nH]c4cc(ccc4c3Cl)C(=O)NC3CC3)c12)C1CCOCC1
: