Target
Proto-oncogene tyrosine-protein kinase receptor Ret
Ligand
BDBM488467
Substrate
Meas. Tech.
Enzyme Assay
IC50
4.15±n/a nM
Citation
 Jordan, AMNewton, RWaszkowycz, BSutton, JMHynd, GPaoletta, SFordyce, EA Heterocyclic compounds as ret kinase inhibitors US Patent  US10954241 Publication Date 3/23/2021 
Target
Name:
Proto-oncogene tyrosine-protein kinase receptor Ret
Synonyms:
CDHF12 Cadherin family member 12 Proto-oncogene c-Ret RET51 Tyrosine-protein kinase Ret (RET)
Type:
Protein
Mol. Mass.:
124318.29
Organism:
Homo sapiens (Human)
Description:
P07949
Residue:
1114
  
Inhibitor
Name:
BDBM488467
Synonyms:
3-[3-Chloro-6-(1,3,4-thiadiazol-2-yl)-1H-indol-2- yl]-1-isopropyl-pyrazolo[3,4-d]pyrimidin-4-amine US11548896, Example 107
Type:
Small organic molecule
Emp. Form.:
C18H15ClN8S
Mol. Mass.:
410.883
SMILES:
CC(C)n1nc(-c2[nH]c3cc(ccc3c2Cl)-c2nncs2)c2c(N)ncnc12
: