BDBM142765 US8940719, 14
SMILES C[C@H](CCC(=O)OC(C)(C)C)C1CC[C@H]2C3CC[C@@H]4C[C@@H](CC[C@]4(C)C3CC[C@]12C)OC(=O)CCC(O)=O
InChI Key InChIKey=RLOHQIHNTUAHPF-FSEQVKJHSA-N
Data  1 IC50
  Tab Delimited (TSV)   2D SDfile   Computed 3D by Vconf -m prep SDfile
Find this compound or compounds like it in BindingDB:
Activity Spreadsheet -- Enzyme Inhibition Constant Data from BindingDB
Found 1 hit for monomerid = 142765
TargetCMP-N-acetylneuraminate-beta-galactosamide-alpha-2,3-sialyltransferase 2(Rattus norvegicus (Rat))
Academia Sinica
US Patent
LigandPNGBDBM142765(US8940719, 14)
Affinity DataIC50:  1.30E+4nM. Assay description: Enzyme activity was determined by monitoring the quantity of sialylated disaccharide product produced over time at 348 nm by RP-HPLC (Supelco Discove...
In DepthDetails US Patent