BDBM173611 9-[3'-[4-[(Thymine-1-yl)methyl]-1,2,3-triazol-1-yl]-b-D-ribofuranosyl]N6-benzoyladenine (11b)
SMILES Cc1cn(Cc2cn(nn2)[C@H]2[C@@H](CO)O[C@H](C2O)n2cnc3c(NC(=O)c4ccccc4)ncnc23)c(=O)[nH]c1=O
InChI Key
Data  2 KI  1 IC50
  Tab Delimited (TSV)   2D SDfile   Computed 3D by Vconf -m prep SDfile
Find this compound or compounds like it in BindingDB:
Activity Spreadsheet -- Enzyme Inhibition Constant Data from BindingDB
Found 2 hits for monomerid = 173611
TargetRibonuclease pancreatic(Bison bison (American bison))
University Of Thessaly
LigandPNGBDBM173611(9-[3'-[4-[(Thymine-1-yl)methyl]-1,2,3-triazol-...)
Affinity DataKi:  1.50E+5nM ΔG°:  -5.30kcal/moleT: 2°C. Assay description: The Ribonuclease Activity assay used was adapted from the procedure described by Anfinsen et al. and Slifman et al. Determination of ribonuclease act...
In DepthDetails ArticlePubMed
TargetNon-secretory ribonuclease(Homo sapiens (Human))
University Of Thessaly
LigandPNGBDBM173611(9-[3'-[4-[(Thymine-1-yl)methyl]-1,2,3-triazol-...)
Affinity DataKi:  2.48E+5nM ΔG°:  -5.00kcal/mole IC50:  3.79E+5nMT: 2°C. Assay description: The Ribonuclease Activity assay used was adapted from the procedure described by Anfinsen et al. and Slifman et al. Determination of ribonuclease act...
In DepthDetails ArticlePubMed