BDBM174003 US9688661, 5-[6-(Methylamino)pyrimidin-4-yl]-2-[2-methyl-5-(trifluoromethyl)phenyl]-1H-pyrrole-3-carboxamide (compd 212)
SMILES CNc1cc(ncn1)-c1cc(C(N)=O)c(n1)-c1cc(ccc1C)C(F)(F)F
InChI Key InChIKey=BKIVRZPOWJNROD-UHFFFAOYSA-N
Data  2 IC50
  Tab Delimited (TSV)   2D SDfile   Computed 3D by Vconf -m prep SDfile
Find this compound or compounds like it in BindingDB:
Activity Spreadsheet -- Enzyme Inhibition Constant Data from BindingDB
Found 2 hits for monomerid = 174003
TargetTyrosine-protein kinase JAK2(Homo sapiens (Human))
Nerviano Medical Sciences
US Patent
LigandPNGBDBM174003(US9688661, 5-[6-(Methylamino)pyrimidin-4-yl]-2-[2-...)
Affinity DataIC50:  21nM. Assay description: Assays were performed with the commercially available JAK2 kinase domain (Invitrogen, Eugene, Oreg.) that showed a linear kinetic without prephosphor...
Ligand InfoPC cidPC sid
In DepthDetails US Patent
TargetTyrosine-protein kinase JAK1 [861-1152](Homo sapiens (Human))
Nerviano Medical Sciences
US Patent
LigandPNGBDBM174003(US9688661, 5-[6-(Methylamino)pyrimidin-4-yl]-2-[2-...)
Affinity DataIC50:  48nM. Assay description: Assays were performed with the JAK1 kinase domain (residues 861-1152 of the 1154 amino acid long full-length sequence, accession number P23458 of Uni...
Ligand InfoPC cidPC sid
In DepthDetails US Patent