BDBM174033 US9688661, 2-[2-Methyl-5-(trifluoromethyl)phenyl]-N-methyl-5-(7H-pyrrolo[2,3-d]pyrimidin-4-yl)-1H-pyrrole-3-carboxamide (compd 318)
SMILES Cc1ccc(cc1-c1c(cc(-c2ncnc3[nH]ccc23)n1C)C(N)=O)C(F)(F)F
InChI Key InChIKey=AIAOADGBMAZZRB-UHFFFAOYSA-N
Data  2 IC50
  Tab Delimited (TSV)   2D SDfile   Computed 3D by Vconf -m prep SDfile
Find this compound or compounds like it in BindingDB:
Activity Spreadsheet -- Enzyme Inhibition Constant Data from BindingDB
Found 2 hits for monomerid = 174033
TargetTyrosine-protein kinase JAK2(Homo sapiens (Human))
Nerviano Medical Sciences
US Patent
LigandPNGBDBM174033(US9688661, 2-[2-Methyl-5-(trifluoromethyl)phenyl]-...)
Affinity DataIC50:  25nM. Assay description: Assays were performed with the commercially available JAK2 kinase domain (Invitrogen, Eugene, Oreg.) that showed a linear kinetic without prephosphor...
Ligand InfoPC cidPC sid
In DepthDetails US Patent
TargetTyrosine-protein kinase JAK1 [861-1152](Homo sapiens (Human))
Nerviano Medical Sciences
US Patent
LigandPNGBDBM174033(US9688661, 2-[2-Methyl-5-(trifluoromethyl)phenyl]-...)
Affinity DataIC50:  63nM. Assay description: Assays were performed with the JAK1 kinase domain (residues 861-1152 of the 1154 amino acid long full-length sequence, accession number P23458 of Uni...
Ligand InfoPC cidPC sid
In DepthDetails US Patent