BDBM18701 (2R)-2-hydroxy-3-iodo-2-methyl-N-[4-nitro-3-(trifluoromethyl)phenyl]propanamide::R-5
SMILES C[C@](O)(CI)C(=O)Nc1ccc(c(c1)C(F)(F)F)[N+]([O-])=O
InChI Key InChIKey=ZIIVSQSRUPHYKS-JTQLQIEISA-N
Data  2 KI  1 EC50
  Tab Delimited (TSV)   2D SDfile   Computed 3D by Vconf -m prep SDfile
Find this compound or compounds like it in BindingDB:
Activity Spreadsheet -- Enzyme Inhibition Constant Data from BindingDB
Found 2 hits for monomerid = 18701
TargetAndrogen receptor(Rattus norvegicus (Rat))
Csc-Scientific Computing
Curated by ChEMBL
LigandPNGBDBM18701((2R)-2-hydroxy-3-iodo-2-methyl-N-[4-nitro-3-(trifl...)
Affinity DataKi:  0.851nM. Assay description: Inhibition of [3H]mibolerone binding to cytosolic androgen receptor of rat ventral prostate
In DepthDetails ArticlePubMed
TargetAndrogen receptor(Rattus norvegicus (Rat))
Csc-Scientific Computing
Curated by ChEMBL
LigandPNGBDBM18701((2R)-2-hydroxy-3-iodo-2-methyl-N-[4-nitro-3-(trifl...)
Affinity DataKi:  0.860nM ΔG°:  -11.5kcal/mole EC50:  500nMpH: 7.4 T: 2°C. Assay description: The Ki values were determined by the application of the Cheng-Prusoff equation: Ki = (IC50 x Kd)/(Kd+[L]) where [L] is the concentration of [3H]MIB (...
In DepthDetails ArticlePubMed