BDBM213186 US9290517, 14
SMILES CC(C)(O)C[NH+]1Cc2cn(nc2C1)-c1ccc(cc1)-c1nc2nc(O[C@@H]3CO[C@@H]4[C@H](O)CO[C@H]34)[nH]c2cc1Cl
InChI Key
Data  1 EC50
  Tab Delimited (TSV)   2D SDfile   Computed 3D by Vconf -m prep SDfile
Find this compound or compounds like it in BindingDB:
Activity Spreadsheet -- Enzyme Inhibition Constant Data from BindingDB
Found 1 hit for monomerid = 213186
LigandPNGBDBM213186(US9290517, 14)
Affinity DataEC50:  29nMpH: 7.3Assay Description:The in vitro AMPK activation assay is performed in a volume of 30 μl in a 384-well plate. Enzyme reactions were assembled in the microtiter plat...
Ligand InfoPC cidPC sid
In DepthDetails US Patent