BDBM225356 Chk1_90
SMILES O=C(Nc1cc([nH]n1)-c1ccccc1)Nc1cnc(cn1)C#N
InChI Key InChIKey=CUGADHZZTWSNMF-UHFFFAOYSA-N
Data  1 KI
PDB links: 1 PDB ID matches this monomer.
  Tab Delimited (TSV)   2D SDfile   Computed 3D by Vconf -m prep SDfile
Find this compound or compounds like it in BindingDB:
Activity Spreadsheet -- Enzyme Inhibition Constant Data from BindingDB
Found 1 hit for monomerid = 225356
TargetSerine/threonine-protein kinase Chk1 [2-280](Homo sapiens (Human))
D3R/Abbott
LigandPNGBDBM225356(Chk1_90)
Affinity DataKi:  23.2nM. Assay description: 33P-Radiometric_Method1
Ligand InfoPC cidPC sidPDB