BDBM225399 Sacchettini_26
SMILES OC(=O)C(O)=CC(=O)c1ccccn1
InChI Key InChIKey=XQSBSYGGKRMMBM-YVMONPNESA-N
Data  1 IC50
  Tab Delimited (TSV)   2D SDfile   Computed 3D by Vconf -m prep SDfile
Find this compound or compounds like it in BindingDB:
Activity Spreadsheet -- Enzyme Inhibition Constant Data from BindingDB
Found 1 hit for monomerid = 225399
TargetMalate synthase G [C619A](Mycobacterium tuberculosis (strain CDC 1551 / Oshk...)
D3R/Abbott
LigandPNGBDBM225399(Sacchettini_26)
Affinity DataIC50: >1.00E+5nM. Assay description: DNTB-Coupled_Enzyme_Assay
In DepthDetails PubMed