BDBM225435 GTC000143A
SMILES O=C1OCc2ccc(Nc3nccc(Nc4cccc5[nH]ncc45)n3)cc12
InChI Key InChIKey=ZCYJOGXPVWMTFY-UHFFFAOYSA-N
Data  4 IC50
  Tab Delimited (TSV)   2D SDfile   Computed 3D by Vconf -m prep SDfile
Find this compound or compounds like it in BindingDB:
Activity Spreadsheet -- Enzyme Inhibition Constant Data from BindingDB
Found 4 hits for monomerid = 225435
TargetTyrosine-protein kinase SYK [355-635](Homo sapiens (Human))
D3R/Abbott
LigandPNGBDBM225435(GTC000143A)
Affinity DataIC50:  58.2nM. Assay description: SYK assay_HTRF
Ligand InfoPC cidPC sid
In DepthDetails PubMed
TargetTyrosine-protein kinase SYK [355-635](Homo sapiens (Human))
D3R/Abbott
LigandPNGBDBM225435(GTC000143A)
Affinity DataIC50:  767nM. Assay description: SYK assay_HTRF
Ligand InfoPC cidPC sid
In DepthDetails PubMed
TargetTyrosine-protein kinase SYK [355-635](Homo sapiens (Human))
D3R/Abbott
LigandPNGBDBM225435(GTC000143A)
Affinity DataIC50:  200nM. Assay description: SYK assay_HTRF
Ligand InfoPC cidPC sid
In DepthDetails PubMed
TargetTyrosine-protein kinase SYK [355-635](Homo sapiens (Human))
D3R/Abbott
LigandPNGBDBM225435(GTC000143A)
Affinity DataIC50:  112nM. Assay description: SYK assay_HTRF
Ligand InfoPC cidPC sid
In DepthDetails PubMed