BDBM225525 GTC000231A
SMILES CC(=O)NCCCCN(c1ccnc(Nc2ccc3[nH]c(=O)[nH]c3c2)n1)c1cccc2[nH]ncc12
InChI Key InChIKey=NUYIDAWBPNJPKB-UHFFFAOYSA-N
Data  1 IC50
  Tab Delimited (TSV)   2D SDfile   Computed 3D by Vconf -m prep SDfile
Find this compound or compounds like it in BindingDB:
Activity Spreadsheet -- Enzyme Inhibition Constant Data from BindingDB
Found 1 hit for monomerid = 225525
TargetTyrosine-protein kinase SYK [355-635](Homo sapiens (Human))
D3R/Abbott
LigandPNGBDBM225525(GTC000231A)
Affinity DataIC50:  1.42nM. Assay description: SYK assay_HTRF
Ligand InfoPC cidPC sid
In DepthDetails PubMed