BDBM225962 FXR_52
SMILES Fc1ccc2nc(COc3ccc(Cl)cc3Cl)n([C@@H](C3CCCCC3)C(=O)NC3CCCCC3)c2c1
InChI Key InChIKey=NQSBAMCZBFHUHJ-MHZLTWQESA-N
Data  1 IC50
  Tab Delimited (TSV)   2D SDfile   Computed 3D by Vconf -m prep SDfile
Find this compound or compounds like it in BindingDB:
Activity Spreadsheet -- Enzyme Inhibition Constant Data from BindingDB
Found 1 hit for monomerid = 225962
TargetBile acid receptor(Homo sapiens (Human))
D3R/Abbott
LigandPNGBDBM225962(FXR_52)
Affinity DataIC50:  340nMpH: 7.4Assay Description:The assay buffer contained 50 mM HEPES (pH 7.4), 10 mM NaCl, 5 mM MgCl2 and 0.01% CHAPS. The reactions were incubated for 30 min in the presence of [...
Ligand InfoPC cidPC sid
In DepthDetails PubMed