BDBM225979 FXR_72
SMILES OC(=O)c1ccc(NC(=O)[C@H](C2CCCCCC2)n2c(nc3cc(F)c(F)cc23)-c2ccc(Cl)cc2)c(F)c1
InChI Key InChIKey=ULHWNJMEHDZQQQ-SANMLTNESA-N
Data  1 IC50
  Tab Delimited (TSV)   2D SDfile   Computed 3D by Vconf -m prep SDfile
Find this compound or compounds like it in BindingDB:
Activity Spreadsheet -- Enzyme Inhibition Constant Data from BindingDB
Found 1 hit for monomerid = 225979
TargetBile acid receptor(Homo sapiens (Human))
D3R/Abbott
LigandPNGBDBM225979(FXR_72)
Affinity DataIC50:  23.5nMpH: 7.4Assay Description:The assay buffer contained 50 mM HEPES (pH 7.4), 10 mM NaCl, 5 mM MgCl2 and 0.01% CHAPS. The reactions were incubated for 30 min in the presence of [...
Ligand InfoPC cidPC sid
In DepthDetails PubMed