BDBM241946 US9428465, 24
SMILES CCCCCCNC(=O)n1cc(Br)c(=O)n(C(=O)OCC(C)C)c1=O
InChI Key InChIKey=UJUANOITAKSBGN-UHFFFAOYSA-N
Data  1 IC50
  Tab Delimited (TSV)   2D SDfile   Computed 3D by Vconf -m prep SDfile
Find this compound or compounds like it in BindingDB:
Activity Spreadsheet -- Enzyme Inhibition Constant Data from BindingDB
Found 1 hit for monomerid = 241946
TargetAcid ceramidase(Homo sapiens (Human))
Fondazione Istituto Italiano Di Technologia
US Patent
LigandPNGBDBM241946(US9428465, 24)
Affinity DataIC50:  14nMpH: 4.5Assay Description:A hAC protein preparation (10 μg) was preincubated with inhibitors (final DMSO concentration 1%) in assay buffer (100 mM sodium phosphate, 0.1% ...
Ligand InfoPC cidPC sid
In DepthDetails US Patent