BDBM24555 2-{[4-chloro-6-(2,3-dihydro-1H-inden-4-ylamino)pyrimidin-2-yl]sulfanyl}acetic acid::Pirinixic acid-based compound, 2g
SMILES OC(=O)CSc1nc(Cl)cc(Nc2cccc3CCCc23)n1
InChI Key InChIKey=OGXCCWPSBAOWEN-UHFFFAOYSA-N
Data  13 EC50
  Tab Delimited (TSV)   2D SDfile   Computed 3D by Vconf -m prep SDfile
Find this compound or compounds like it in BindingDB:
Activity Spreadsheet -- Enzyme Inhibition Constant Data from BindingDB
Found 13 hits for monomerid = 24555
TargetPolyunsaturated fatty acid 5-lipoxygenase(Homo sapiens (Human))
Eberhard Karls University Tuebingen
LigandPNGBDBM24555(2-{[4-chloro-6-(2,3-dihydro-1H-inden-4-ylamino)pyr...)
Affinity DataEC50:  3.90E+3nMpH: 7.4 T: 2°C. Assay description: For assays of intact cells, 5000,000 freshly isolated PMNL cells were resuspended in PGC buffer. After preincubation with the test compounds for 15 m...
In DepthDetails ArticlePubMed
TargetPeroxisome proliferator-activated receptor alpha(Homo sapiens (Human))
Goethe University Frankfurt
Curated by ChEMBL
LigandPNGBDBM24555(2-{[4-chloro-6-(2,3-dihydro-1H-inden-4-ylamino)pyr...)
Affinity DataEC50:  1.60E+4nM. Assay description: Activation of human Gal4-fused PPARalpha LBD transfected in HEK293T after 14 to 16 hrs by dual-glo luciferase reporter gene assay
In DepthDetails ArticlePubMed
TargetPeroxisome proliferator-activated receptor gamma(Homo sapiens (Human))
Goethe University Frankfurt
Curated by ChEMBL
LigandPNGBDBM24555(2-{[4-chloro-6-(2,3-dihydro-1H-inden-4-ylamino)pyr...)
Affinity DataEC50:  3.80E+4nM. Assay description: Activation of human Gal4-fused PPARgamma LBD transfected in HEK293T after 14 to 16 hrs by dual-glo luciferase reporter gene assay
In DepthDetails ArticlePubMed
TargetRetinoic acid receptor RXR-alpha(Homo sapiens (Human))
Goethe University Frankfurt
Curated by ChEMBL
LigandPNGBDBM24555(2-{[4-chloro-6-(2,3-dihydro-1H-inden-4-ylamino)pyr...)
Affinity DataEC50:  1.50E+3nM. Assay description: Activation of human Gal4-fused RXRalpha LBD transfected in HEK293T after 14 to 16 hrs by dual-glo luciferase reporter gene assay
In DepthDetails ArticlePubMed
TargetRetinoic acid receptor RXR-gamma(Homo sapiens (Human))
Goethe University Frankfurt
Curated by ChEMBL
LigandPNGBDBM24555(2-{[4-chloro-6-(2,3-dihydro-1H-inden-4-ylamino)pyr...)
Affinity DataEC50:  5.60E+3nM. Assay description: Activation of human Gal4-fused RXRgamma LBD transfected in HEK293T after 14 to 16 hrs by dual-glo luciferase reporter gene assay
In DepthDetails ArticlePubMed
TargetRetinoic acid receptor RXR-gamma(Homo sapiens (Human))
Goethe University Frankfurt
Curated by ChEMBL
LigandPNGBDBM24555(2-{[4-chloro-6-(2,3-dihydro-1H-inden-4-ylamino)pyr...)
Affinity DataEC50:  5.60E+3nM. Assay description: Activation of human Gal4-fused RXRgamma LBD transfected in HEK293T after 14 to 16 hrs by dual-glo luciferase reporter gene assay
In DepthDetails ArticlePubMed
TargetPeroxisome proliferator-activated receptor alpha(Homo sapiens (Human))
Goethe University Frankfurt
Curated by ChEMBL
LigandPNGBDBM24555(2-{[4-chloro-6-(2,3-dihydro-1H-inden-4-ylamino)pyr...)
Affinity DataEC50:  1.60E+4nM. Assay description: Activation of human Gal4-fused PPARalpha LBD transfected in HEK293T after 14 to 16 hrs by dual-glo luciferase reporter gene assay
In DepthDetails ArticlePubMed
TargetPeroxisome proliferator-activated receptor gamma(Homo sapiens (Human))
Goethe University Frankfurt
Curated by ChEMBL
LigandPNGBDBM24555(2-{[4-chloro-6-(2,3-dihydro-1H-inden-4-ylamino)pyr...)
Affinity DataEC50:  3.80E+4nM. Assay description: Activation of human Gal4-fused PPARgamma LBD transfected in HEK293T after 14 to 16 hrs by dual-glo luciferase reporter gene assay
In DepthDetails ArticlePubMed
TargetPeroxisome proliferator-activated receptor delta(Homo sapiens (Human))
Goethe University Frankfurt
Curated by ChEMBL
LigandPNGBDBM24555(2-{[4-chloro-6-(2,3-dihydro-1H-inden-4-ylamino)pyr...)
Affinity DataEC50: >1.00E+5nM. Assay description: Activation of human Gal4-fused PPARdelta LBD transfected in HEK293T after 14 to 16 hrs by dual-glo luciferase reporter gene assay
In DepthDetails ArticlePubMed
TargetRetinoic acid receptor RXR-alpha(Homo sapiens (Human))
Goethe University Frankfurt
Curated by ChEMBL
LigandPNGBDBM24555(2-{[4-chloro-6-(2,3-dihydro-1H-inden-4-ylamino)pyr...)
Affinity DataEC50:  1.50E+3nM. Assay description: Activation of human Gal4-fused RXRalpha LBD transfected in HEK293T after 14 to 16 hrs by dual-glo luciferase reporter gene assay
In DepthDetails ArticlePubMed
TargetRetinoic acid receptor RXR-beta(Homo sapiens (Human))
Goethe University Frankfurt
Curated by ChEMBL
LigandPNGBDBM24555(2-{[4-chloro-6-(2,3-dihydro-1H-inden-4-ylamino)pyr...)
Affinity DataEC50:  3.10E+3nM. Assay description: Activation of human Gal4-fused RXRbeta LBD transfected in HEK293T after 14 to 16 hrs by dual-glo luciferase reporter gene assay
In DepthDetails ArticlePubMed
TargetRetinoic acid receptor RXR-beta(Homo sapiens (Human))
Goethe University Frankfurt
Curated by ChEMBL
LigandPNGBDBM24555(2-{[4-chloro-6-(2,3-dihydro-1H-inden-4-ylamino)pyr...)
Affinity DataEC50:  3.10E+3nM. Assay description: Activation of human Gal4-fused RXRbeta LBD transfected in HEK293T after 14 to 16 hrs by dual-glo luciferase reporter gene assay
In DepthDetails ArticlePubMed
TargetPeroxisome proliferator-activated receptor delta(Homo sapiens (Human))
Goethe University Frankfurt
Curated by ChEMBL
LigandPNGBDBM24555(2-{[4-chloro-6-(2,3-dihydro-1H-inden-4-ylamino)pyr...)
Affinity DataEC50: >1.00E+5nM. Assay description: Activation of human Gal4-fused PPARdelta LBD transfected in HEK293T after 14 to 16 hrs by dual-glo luciferase reporter gene assay
In DepthDetails ArticlePubMed