BDBM257410 US9493441, 1-21
SMILES CC(C)(CC#N)n1cc(C(N)=O)c(Nc2ccccc2)n1
InChI Key InChIKey=ZLTXIWWIGISOAQ-UHFFFAOYSA-N
Data  2 IC50
  Tab Delimited (TSV)   2D SDfile   Computed 3D by Vconf -m prep SDfile
Find this compound or compounds like it in BindingDB:
Activity Spreadsheet -- Enzyme Inhibition Constant Data from BindingDB
Found 2 hits for monomerid = 257410
TargetGlutathione S-transferase P/Tyrosine-protein kinase JAK2(Homo sapiens (Human))
Merck Sharp & Dohme
US Patent
LigandPNGBDBM257410(US9493441, 1-21)
Affinity DataIC50:  103nMT: 2°C. Assay description: The ability of compounds to inhibit the activity of JAK1, JAK2, JAK3, and Tyk2 was measured using a recombinant purified GST-tagged catalytic domain ...
Ligand InfoPC cidPC sid
In DepthDetails US Patent
TargetGlutathione S-transferase P/Tyrosine-protein kinase JAK1(Homo sapiens (Human))
Merck Sharp & Dohme
US Patent
LigandPNGBDBM257410(US9493441, 1-21)
Affinity DataIC50:  12nMT: 2°C. Assay description: The ability of compounds to inhibit the activity of JAK1, JAK2, JAK3, and Tyk2 was measured using a recombinant purified GST-tagged catalytic domain ...
Ligand InfoPC cidPC sid
In DepthDetails US Patent