BDBM257469 US9493441, 11-7
SMILES NC(=O)c1cn(nc1Nc1ccc(F)cc1)[C@@H](CC#N)C1CCN(CC1)C(=O)OCC(F)(F)F
InChI Key InChIKey=NNLQKMDEOKLSQL-KRWDZBQOSA-N
Data  2 IC50
  Tab Delimited (TSV)   2D SDfile   Computed 3D by Vconf -m prep SDfile
Find this compound or compounds like it in BindingDB:
Activity Spreadsheet -- Enzyme Inhibition Constant Data from BindingDB
Found 2 hits for monomerid = 257469
TargetGlutathione S-transferase P/Tyrosine-protein kinase JAK2(Homo sapiens (Human))
Merck Sharp & Dohme
US Patent
LigandPNGBDBM257469(US9493441, 11-7)
Affinity DataIC50:  425nMT: 2°C. Assay description: The ability of compounds to inhibit the activity of JAK1, JAK2, JAK3, and Tyk2 was measured using a recombinant purified GST-tagged catalytic domain ...
Ligand InfoPC cidPC sid
In DepthDetails US Patent
TargetGlutathione S-transferase P/Tyrosine-protein kinase JAK1(Homo sapiens (Human))
Merck Sharp & Dohme
US Patent
LigandPNGBDBM257469(US9493441, 11-7)
Affinity DataIC50:  7nMT: 2°C. Assay description: The ability of compounds to inhibit the activity of JAK1, JAK2, JAK3, and Tyk2 was measured using a recombinant purified GST-tagged catalytic domain ...
Ligand InfoPC cidPC sid
In DepthDetails US Patent