BDBM257493 US9493441, 17-5
SMILES NC(=O)c1cn(nc1Nc1ccnc(F)c1)[C@@H](CC#N)C1CC1
InChI Key InChIKey=RBHGKYJXGOGINC-LBPRGKRZSA-N
Data  2 IC50
  Tab Delimited (TSV)   2D SDfile   Computed 3D by Vconf -m prep SDfile
Find this compound or compounds like it in BindingDB:
Activity Spreadsheet -- Enzyme Inhibition Constant Data from BindingDB
Found 2 hits for monomerid = 257493
TargetGlutathione S-transferase P/Tyrosine-protein kinase JAK2(Homo sapiens (Human))
Merck Sharp & Dohme
US Patent
LigandPNGBDBM257493(US9493441, 17-5)
Affinity DataIC50:  190nMT: 2°C. Assay description: The ability of compounds to inhibit the activity of JAK1, JAK2, JAK3, and Tyk2 was measured using a recombinant purified GST-tagged catalytic domain ...
Ligand InfoPC cidPC sid
In DepthDetails US Patent
TargetGlutathione S-transferase P/Tyrosine-protein kinase JAK1(Homo sapiens (Human))
Merck Sharp & Dohme
US Patent
LigandPNGBDBM257493(US9493441, 17-5)
Affinity DataIC50:  16nMT: 2°C. Assay description: The ability of compounds to inhibit the activity of JAK1, JAK2, JAK3, and Tyk2 was measured using a recombinant purified GST-tagged catalytic domain ...
Ligand InfoPC cidPC sid
In DepthDetails US Patent