BDBM26299 N-(2,3-difluorophenyl)-2-{3-[(7-{3-[(2R)-2-(hydroxymethyl)pyrrolidin-1-yl]propoxy}quinazolin-4-yl)amino]-1H-pyrazol-5-yl}acetamide::pyrazoloquinazoline deriv., 33
SMILES OC[C@H]1CCCN1CCCOc1ccc2c(Nc3cc(CC(=O)Nc4cccc(F)c4F)n[nH]3)ncnc2c1
InChI Key InChIKey=ZNGNLXZBVWXEKM-GOSISDBHSA-N
Data  2 KI
  Tab Delimited (TSV)   2D SDfile   Computed 3D by Vconf -m prep SDfile
Find this compound or compounds like it in BindingDB:
Activity Spreadsheet -- Enzyme Inhibition Constant Data from BindingDB
Found 2 hits for monomerid = 26299
TargetAurora kinase B(Homo sapiens (Human))
Astrazeneca
LigandPNGBDBM26299(N-(2,3-difluorophenyl)-2-{3-[(7-{3-[(2R)-2-(hydrox...)
Affinity DataKi: <1nM ΔG°: <-12.3kcal/moleT: 2°C. Assay description: In vitro kinase assay using recombinant Aurora B bound to INCENP was incubated at room temperature with substrate, and test compounds in the presence...
In DepthDetails ArticlePubMed
TargetAurora kinase A(Homo sapiens (Human))
Astrazeneca
LigandPNGBDBM26299(N-(2,3-difluorophenyl)-2-{3-[(7-{3-[(2R)-2-(hydrox...)
Affinity DataKi:  950nM ΔG°:  -8.21kcal/moleT: 2°C. Assay description: In vitro kinase assay using recombinant Aurora A purified from Sf9 cells was incubated at room temperature with substrate, and test compounds in the ...
In DepthDetails ArticlePubMed