BDBM281008 (7S,10S,13S)? 13-((1H-Indol-3-yl)methyl)-10-(4-aminobutyl)-7-(3-aminopropyl)-18-chloro-12-methyl-6,7,9,10,12,13,15,16-octahydrodipyrido[2,3-b:4',3'-p][1,5,8,11,14]thiatetraazacycloheptadecine-8,11,14(5H)-trione::US10030047, Example 159
SMILES CN1[C@@H](Cc2c[nH]c3ccccc23)C(=O)NCc2cc(Cl)ncc2Sc2ncccc2CN[C@@H](CCCN)C(=O)N[C@@H](CCCCN)C1=O
InChI Key
Data  1 IC50
  Tab Delimited (TSV)   2D SDfile   Computed 3D by Vconf -m prep SDfile
Find this compound or compounds like it in BindingDB:
Activity Spreadsheet -- Enzyme Inhibition Constant Data from BindingDB
Found 1 hit for monomerid = 281008
TargetAdhesin Ata autotransporter(Acinetobacter baumannii (strain ATCC 17978 / CIP 5...)
Hoffmann-La Roche
US Patent
LigandPNGBDBM281008((7S,10S,13S)? 13-((1H-Indol-3-yl)methyl)-10-(4-ami...)
Affinity DataIC50: <390nM. Assay description: The in vitro antimicrobial activity of the compounds was alternatively determined according to the following procedure:The assay used a 10-points Iso...
Ligand InfoPC cidPC sid
In DepthDetails US Patent