BDBM281016 (8S,11S,14S)-8-((1H-Indol-3-yl)methyl)-11-(4-aminobutyl)-14-(3-aminopropyl)-4-chloro-9-methyl-1-(2-(trifluoromethyl)pyridin-4-yl)-5,6,8,9,11,12,15,16-octahydrobenzo[b]pyrido[4,3-p][1,5,8,11,14]thiatetraazacycloheptadecine-7,10,13(14H)-trione::US10030047, Example 198
SMILES CN1[C@@H](Cc2c[nH]c3ccccc23)C(=O)NCc2c(Cl)cnc(-c3ccnc(c3)C(F)(F)F)c2Sc2ccccc2CN[C@@H](CCCN)C(=O)N[C@@H](CCCCN)C1=O
InChI Key
Data  1 IC50
  Tab Delimited (TSV)   2D SDfile   Computed 3D by Vconf -m prep SDfile
Find this compound or compounds like it in BindingDB:
Activity Spreadsheet -- Enzyme Inhibition Constant Data from BindingDB
Found 1 hit for monomerid = 281016
TargetAdhesin Ata autotransporter(Acinetobacter baumannii (strain ATCC 17978 / CIP 5...)
Hoffmann-La Roche
US Patent
LigandPNGBDBM281016((8S,11S,14S)-8-((1H-Indol-3-yl)methyl)-11-(4-amino...)
Affinity DataIC50:  300nM. Assay description: The in vitro antimicrobial activity of the compounds was alternatively determined according to the following procedure:The assay used a 10-points Iso...
Ligand InfoPC cidPC sid
In DepthDetails US Patent