BDBM329971 US10463675, Example 54::US10980815, Ex. No. 54::US11197867, Example 54::US9663526, Example 54
SMILES CNC(=O)c1ncc(Nc2nccc(n2)N2C[C@@H]3CC[C@H](C2)N3CC2(C)COC2)cc1C
InChI Key InChIKey=DYBUDHYBMFQGLU-HDICACEKSA-N
Data  16 IC50
  Tab Delimited (TSV)   2D SDfile   Computed 3D by Vconf -m prep SDfile
Find this compound or compounds like it in BindingDB:
Activity Spreadsheet -- Enzyme Inhibition Constant Data from BindingDB
Found 16 hits for monomerid = 329971
TargetNon-receptor tyrosine-protein kinase TYK2(Homo sapiens (Human))
Pfizer
US Patent
LigandPNGBDBM329971(US10463675, Example 54 | US10980815, Ex. No. 54 | ...)
Affinity DataIC50:  8nM. Assay description: Compounds were added to a 384-well plate. Reaction mixtures contained 10 mM HEPES, pH 7.4, 10 mM MgCl2, 0.01% BSA, 0.0005% Tween 20, 1 mM ATP and 1 &...
Ligand InfoPC cidPC sid
In DepthDetails US Patent
TargetTyrosine-protein kinase JAK3(Homo sapiens (Human))
Pfizer
US Patent
LigandPNGBDBM329971(US10463675, Example 54 | US10980815, Ex. No. 54 | ...)
Affinity DataIC50:  4.29E+3nM. Assay description: Compounds were added to a 384-well plate. Reaction mixtures contained 10 mM HEPES, pH 7.4, 10 mM MgCl2, 0.01% BSA, 0.0005% Tween 20, 1 mM ATP and 1 M...
Ligand InfoPC cidPC sid
In DepthDetails US Patent
TargetTyrosine-protein kinase JAK2(Homo sapiens (Human))
Pfizer
US Patent
LigandPNGBDBM329971(US10463675, Example 54 | US10980815, Ex. No. 54 | ...)
Affinity DataIC50:  29nM
Ligand InfoPC cidPC sid
In DepthDetails US Patent
TargetTyrosine-protein kinase JAK3(Homo sapiens (Human))
Pfizer
US Patent
LigandPNGBDBM329971(US10463675, Example 54 | US10980815, Ex. No. 54 | ...)
Affinity DataIC50:  4.29E+3nM
Ligand InfoPC cidPC sid
In DepthDetails US Patent
TargetNon-receptor tyrosine-protein kinase TYK2(Homo sapiens (Human))
Pfizer
US Patent
LigandPNGBDBM329971(US10463675, Example 54 | US10980815, Ex. No. 54 | ...)
Affinity DataIC50:  8nM. Assay description: Compounds were added to a 384-well plate. Reaction mixtures contained 10 mM HEPES, pH 7.4, 10 mM MgCl2, 0.01% BSA, 0.0005% Tween 20, 1 mM ATP and 1 &...
Ligand InfoPC cidPC sid
In DepthDetails US Patent
TargetTyrosine-protein kinase JAK1(Homo sapiens (Human))
Pfizer
US Patent
LigandPNGBDBM329971(US10463675, Example 54 | US10980815, Ex. No. 54 | ...)
Affinity DataIC50:  19nM. Assay description: Compounds were added to a 384-well plate. Reaction mixtures contained 10 mM HEPES, pH 7.4, 10 mM MgCl2, 0.01% BSA, 0.0005% Tween 20, 1 mM ATP and 1 &...
Ligand InfoPC cidPC sid
In DepthDetails US Patent
TargetTyrosine-protein kinase JAK2(Homo sapiens (Human))
Pfizer
US Patent
LigandPNGBDBM329971(US10463675, Example 54 | US10980815, Ex. No. 54 | ...)
Affinity DataIC50:  29nM. Assay description: Compounds were added to a 384-well plate. Reaction mixtures contained 10 mM HEPES, pH 7.4, 10 mM MgCl2, 0.01% BSA, 0.0005% Tween 20, 1 mM ATP and 1 &...
Ligand InfoPC cidPC sid
In DepthDetails US Patent
TargetTyrosine-protein kinase JAK3(Homo sapiens (Human))
Pfizer
US Patent
LigandPNGBDBM329971(US10463675, Example 54 | US10980815, Ex. No. 54 | ...)
Affinity DataIC50:  4.29E+3nM. Assay description: Compounds were added to a 384-well plate. Reaction mixtures contained 10 mM HEPES, pH 7.4, 10 mM MgCl2, 0.01% BSA, 0.0005% Tween 20, 1 mM ATP and 1 &...
Ligand InfoPC cidPC sid
In DepthDetails US Patent
TargetNon-receptor tyrosine-protein kinase TYK2(Homo sapiens (Human))
Pfizer
US Patent
LigandPNGBDBM329971(US10463675, Example 54 | US10980815, Ex. No. 54 | ...)
Affinity DataIC50:  8nM. Assay description: Compounds were added to a 384-well plate. Reaction mixtures contained 10 mM HEPES, pH 7.4, 10 mM MgCl2, 0.01% BSA, 0.0005% Tween 20, 1 mM ATP and 1 &...
Ligand InfoPC cidPC sid
In DepthDetails US Patent
TargetTyrosine-protein kinase JAK1(Homo sapiens (Human))
Pfizer
US Patent
LigandPNGBDBM329971(US10463675, Example 54 | US10980815, Ex. No. 54 | ...)
Affinity DataIC50:  19nM. Assay description: Compounds were added to a 384-well plate. Reaction mixtures contained 10 mM HEPES, pH 7.4, 10 mM MgCl2, 0.01% BSA, 0.0005% Tween 20, 1 mM ATP and 1 &...
Ligand InfoPC cidPC sid
In DepthDetails US Patent
TargetTyrosine-protein kinase JAK2(Homo sapiens (Human))
Pfizer
US Patent
LigandPNGBDBM329971(US10463675, Example 54 | US10980815, Ex. No. 54 | ...)
Affinity DataIC50:  29nM. Assay description: Compounds were added to a 384-well plate. Reaction mixtures contained 10 mM HEPES, pH 7.4, 10 mM MgCl2, 0.01% BSA, 0.0005% Tween 20, 1 mM ATP and 1 &...
Ligand InfoPC cidPC sid
In DepthDetails US Patent
TargetTyrosine-protein kinase JAK3(Homo sapiens (Human))
Pfizer
US Patent
LigandPNGBDBM329971(US10463675, Example 54 | US10980815, Ex. No. 54 | ...)
Affinity DataIC50:  4.29E+3nM. Assay description: Compounds were added to a 384-well plate. Reaction mixtures contained 10 mM HEPES, pH 7.4, 10 mM MgCl2, 0.01% BSA, 0.0005% Tween 20, 1 mM ATP and 1 &...
Ligand InfoPC cidPC sid
In DepthDetails US Patent
TargetNon-receptor tyrosine-protein kinase TYK2(Homo sapiens (Human))
Pfizer
US Patent
LigandPNGBDBM329971(US10463675, Example 54 | US10980815, Ex. No. 54 | ...)
Affinity DataIC50:  8nM. Assay description: Compounds were added to a 384-well plate. Reaction mixtures contained 10 mM HEPES, pH 7.4, 10 mM MgCl2, 0.01% BSA, 0.0005% Tween 20, 1 mM ATP and 1 M...
Ligand InfoPC cidPC sid
In DepthDetails US Patent
TargetTyrosine-protein kinase JAK1(Homo sapiens (Human))
Pfizer
US Patent
LigandPNGBDBM329971(US10463675, Example 54 | US10980815, Ex. No. 54 | ...)
Affinity DataIC50:  19nM. Assay description: Compounds were added to a 384-well plate. Reaction mixtures contained 10 mM HEPES, pH 7.4, 10 mM MgCl2, 0.01% BSA, 0.0005% Tween 20, 1 mM ATP and 1 M...
Ligand InfoPC cidPC sid
In DepthDetails US Patent
TargetTyrosine-protein kinase JAK2(Homo sapiens (Human))
Pfizer
US Patent
LigandPNGBDBM329971(US10463675, Example 54 | US10980815, Ex. No. 54 | ...)
Affinity DataIC50:  29nM. Assay description: Compounds were added to a 384-well plate. Reaction mixtures contained 10 mM HEPES, pH 7.4, 10 mM MgCl2, 0.01% BSA, 0.0005% Tween 20, 1 mM ATP and 1 M...
Ligand InfoPC cidPC sid
In DepthDetails US Patent
TargetTyrosine-protein kinase JAK1(Homo sapiens (Human))
Pfizer
US Patent
LigandPNGBDBM329971(US10463675, Example 54 | US10980815, Ex. No. 54 | ...)
Affinity DataIC50:  19nM
Ligand InfoPC cidPC sid
In DepthDetails US Patent