BDBM35661 erk000595::pyrimidylpyrrole, 11i
SMILES Cc1cnc(Nc2cccc3CCCCc23)nc1-c1c[nH]c(c1)C(=O)N[C@H](CO)c1cccc(Cl)c1
InChI Key InChIKey=GNNGWQSTNJCADU-RUZDIDTESA-N
Data  6 KI
  Tab Delimited (TSV)   2D SDfile   Computed 3D by Vconf -m prep SDfile
Find this compound or compounds like it in BindingDB:
Activity Spreadsheet -- Enzyme Inhibition Constant Data from BindingDB
Found 1 hit for monomerid = 35661
TargetCyclin-A2/Cyclin-dependent kinase 2(Homo sapiens (Human))
Vertex Pharmaceuticals
LigandPNGBDBM35661(erk000595 | pyrimidylpyrrole, 11i)
Affinity DataKi:  250nM. Assay description: A coupled spectrophotometric assay was used in which ADP generated by kinase was converted to ATP with the concomitant production of pyruvate from PE...
In DepthDetails ArticlePubMed