BDBM400339 US10695337, Example 93::US11285140, Example 93::US9999619, Example 94
SMILES FC(F)(F)c1cccc2sc(cc12)C(=O)N1CCC(CC1)N1CC(CC#N)(C1)n1cc(cn1)-c1ncnc2[nH]ccc12
InChI Key InChIKey=GIEBVJXOLCOONO-UHFFFAOYSA-N
Data  6 IC50
  Tab Delimited (TSV)   2D SDfile   Computed 3D by Vconf -m prep SDfile
Find this compound or compounds like it in BindingDB:
Activity Spreadsheet -- Enzyme Inhibition Constant Data from BindingDB
Found 6 hits for monomerid = 400339
TargetTyrosine-protein kinase JAK1 [837-1142](Homo sapiens (Human))
Incyte Holdings
US Patent
LigandPNGBDBM400339(US10695337, Example 93 | US11285140, Example 93 | ...)
Affinity DataIC50:  30nM. Assay description: Compounds herein were tested for inhibitory activity of JAK targets according to the following in vitro assay described in Park et al., Analytical Bi...
Ligand InfoPC cidPC sid
In DepthDetails US Patent
TargetTyrosine-protein kinase JAK2 [828-1132](Homo sapiens (Human))
Incyte Holdings
US Patent
LigandPNGBDBM400339(US10695337, Example 93 | US11285140, Example 93 | ...)
Affinity DataIC50:  12.5nM. Assay description: Compounds herein were tested for inhibitory activity of JAK targets according to the following in vitro assay described in Park et al., Analytical Bi...
Ligand InfoPC cidPC sid
In DepthDetails US Patent
TargetTyrosine-protein kinase JAK2 [828-1132](Homo sapiens (Human))
Incyte Holdings
US Patent
LigandPNGBDBM400339(US10695337, Example 93 | US11285140, Example 93 | ...)
Affinity DataIC50: <10nM
Ligand InfoPC cidPC sid
In DepthDetails US Patent
TargetTyrosine-protein kinase JAK2 [828-1132](Homo sapiens (Human))
Incyte Holdings
US Patent
LigandPNGBDBM400339(US10695337, Example 93 | US11285140, Example 93 | ...)
Affinity DataIC50: <10nM. Assay description: The catalytic domains of human JAK1 (a.a. 837-1142), Jak2 (a.a. 828-1132) and Jak3 (a.a. 781-1124) with an N-terminal His tag were expressed using ba...
Ligand InfoPC cidPC sid
In DepthDetails US Patent
TargetTyrosine-protein kinase JAK1 [837-1142](Homo sapiens (Human))
Incyte Holdings
US Patent
LigandPNGBDBM400339(US10695337, Example 93 | US11285140, Example 93 | ...)
Affinity DataIC50: <5nM. Assay description: Compounds herein were tested for inhibitory activity of JAK targets according to the following in vitro assay described in Park et al., Analytical Bi...
Ligand InfoPC cidPC sid
In DepthDetails US Patent
TargetTyrosine-protein kinase JAK1 [837-1142](Homo sapiens (Human))
Incyte Holdings
US Patent
LigandPNGBDBM400339(US10695337, Example 93 | US11285140, Example 93 | ...)
Affinity DataIC50: <5nM. Assay description: The catalytic domains of human JAK1 (a.a. 837-1142), Jak2 (a.a. 828-1132) and Jak3 (a.a. 781-1124) with an N-terminal His tag were expressed using ba...
Ligand InfoPC cidPC sid
In DepthDetails US Patent