BDBM400639 3,5-difluorobenzyl 4-{3- (cyanomethyl)-3-[4-(7H- pyrrolo[2,3-d]pyrimidin-4- yl)-1H-pyrazol-1- yl]azetidin-1- yl}piperidine-1- carboxylate::US10695337, Example 395::US11285140, Example 395::US9999619, Example 395
SMILES Fc1cc(F)cc(COC(=O)N2CCC(CC2)N2CC(CC#N)(C2)n2cc(cn2)-c2ncnc3[nH]ccc23)c1
InChI Key InChIKey=NGMZDEADJNNQBR-UHFFFAOYSA-N
Data  6 IC50
  Tab Delimited (TSV)   2D SDfile   Computed 3D by Vconf -m prep SDfile
Find this compound or compounds like it in BindingDB:
Activity Spreadsheet -- Enzyme Inhibition Constant Data from BindingDB
Found 6 hits for monomerid = 400639
TargetTyrosine-protein kinase JAK1 [837-1142](Homo sapiens (Human))
Incyte Holdings
US Patent
LigandPNGBDBM400639(3,5-difluorobenzyl 4-{3- (cyanomethyl)-3-[4-(7H- p...)
Affinity DataIC50: <10nM. Assay description: Compounds herein were tested for inhibitory activity of JAK targets according to the following in vitro assay described in Park et al., Analytical Bi...
Ligand InfoPC cidPC sid
In DepthDetails US Patent
TargetTyrosine-protein kinase JAK2 [828-1132](Homo sapiens (Human))
Incyte Holdings
US Patent
LigandPNGBDBM400639(3,5-difluorobenzyl 4-{3- (cyanomethyl)-3-[4-(7H- p...)
Affinity DataIC50:  25nM. Assay description: Compounds herein were tested for inhibitory activity of JAK targets according to the following in vitro assay described in Park et al., Analytical Bi...
Ligand InfoPC cidPC sid
In DepthDetails US Patent
TargetTyrosine-protein kinase JAK2 [828-1132](Homo sapiens (Human))
Incyte Holdings
US Patent
LigandPNGBDBM400639(3,5-difluorobenzyl 4-{3- (cyanomethyl)-3-[4-(7H- p...)
Affinity DataIC50:  75nM
Ligand InfoPC cidPC sid
In DepthDetails US Patent
TargetTyrosine-protein kinase JAK2 [828-1132](Homo sapiens (Human))
Incyte Holdings
US Patent
LigandPNGBDBM400639(3,5-difluorobenzyl 4-{3- (cyanomethyl)-3-[4-(7H- p...)
Affinity DataIC50:  75nM. Assay description: The catalytic domains of human JAK1 (a.a. 837-1142), Jak2 (a.a. 828-1132) and Jak3 (a.a. 781-1124) with an N-terminal His tag were expressed using ba...
Ligand InfoPC cidPC sid
In DepthDetails US Patent
TargetTyrosine-protein kinase JAK1 [837-1142](Homo sapiens (Human))
Incyte Holdings
US Patent
LigandPNGBDBM400639(3,5-difluorobenzyl 4-{3- (cyanomethyl)-3-[4-(7H- p...)
Affinity DataIC50: <5nM. Assay description: Compounds herein were tested for inhibitory activity of JAK targets according to the following in vitro assay described in Park et al., Analytical Bi...
Ligand InfoPC cidPC sid
In DepthDetails US Patent
TargetTyrosine-protein kinase JAK1 [837-1142](Homo sapiens (Human))
Incyte Holdings
US Patent
LigandPNGBDBM400639(3,5-difluorobenzyl 4-{3- (cyanomethyl)-3-[4-(7H- p...)
Affinity DataIC50: <5nM. Assay description: The catalytic domains of human JAK1 (a.a. 837-1142), Jak2 (a.a. 828-1132) and Jak3 (a.a. 781-1124) with an N-terminal His tag were expressed using ba...
Ligand InfoPC cidPC sid
In DepthDetails US Patent