BDBM440743 (?)-2-Fluoro-4-(trifluoromethoxy)benzyl 2-(4,5,6,7-tetrahydro-1H-benzo[d][1,2,3]triazole-5-carbonyl)-2,7-diazaspiro[3.5]nonane-7-carboxylate and (+)-2-fluoro-4-(trifluoromethoxy)benzyl 2-(4,5,6,7-tetrahydro-1H-benzo[d][1,2,3]triazole-5-carbonyl)-2,7-diazaspiro[3.5]nonane-7-carboxylate::US10633384, Example 15B
SMILES Fc1cc(OC(F)(F)F)ccc1COC(=O)N1CCC2(CN(C2)C(=O)[C@H]2CCc3[nH]nnc3C2)CC1.Fc1cc(OC(F)(F)F)ccc1COC(=O)N1CCC2(CN(C2)C(=O)[C@@H]2CCc3[nH]nnc3C2)CC1
InChI Key InChIKey=GEFAERQRUSVKMP-IKFJUQJOSA-N
Data  1 IC50
  Tab Delimited (TSV)   2D SDfile   Computed 3D by Vconf -m prep SDfile
Find this compound or compounds like it in BindingDB:
Activity Spreadsheet -- Enzyme Inhibition Constant Data from BindingDB
Found 1 hit for monomerid = 440743
TargetAtaxin-2(Homo sapiens (Human))
Hoffmann-La Roche
US Patent
LigandPNGBDBM440743((?)-2-Fluoro-4-(trifluoromethoxy)benzyl 2-(4,5,6,7...)
Affinity DataIC50:  1nM. Assay description: ATX inhibition was measured by a fluorescence quenching assay using a specifically labeled substrate analogue (MR121 substrate). To obtain this MR121...
Ligand InfoPC cidPC sid
In DepthDetails US Patent