BDBM456927 US10736974, Compound C8
SMILES OC(=O)CC[C@H](NC(=O)NCCCCCNC(=O)c1cncc(I)c1)C(O)=O
InChI Key InChIKey=HFIHMGANUNMANC-ZDUSSCGKSA-N
Data  1 KI
  Tab Delimited (TSV)   2D SDfile   Computed 3D by Vconf -m prep SDfile
Find this compound or compounds like it in BindingDB:
Activity Spreadsheet -- Enzyme Inhibition Constant Data from BindingDB
Found 1 hit for monomerid = 456927
TargetGlutamate carboxypeptidase 2(Homo sapiens (Human))
The Johns Hopkins University
US Patent
LigandPNGBDBM456927(US10736974, Compound C8)
Affinity DataKi:  0.350nM. Assay description: The PSMA inhibitory activity was determined using a modification of the fluorescence-based Amplex Red Glutamic Acid Assay. Briefly, lysates of LNCaP ...
Ligand InfoPC cidPC sid
In DepthDetails US Patent