BDBM4695 (3R,3aS,6aR)-hexahydrofuro[2,3-b]furan-3-yl N-[(2S,3R)-4-[2H-1,3-benzodioxole-5-({4-[(methoxycarbonyl)amino]-2,2-dimethylbutyl})sulfonamido]-3-hydroxy-1-phenylbutan-2-yl]carbamate::arylsulfonamide 13
SMILES [H][C@@]12CCO[C@]1([H])OC[C@@H]2OC(=O)N[C@@H](Cc1ccccc1)[C@H](O)CN(CC(C)(C)CCNC(=O)OC)S(=O)(=O)c1ccc2OCOc2c1
InChI Key InChIKey=IJFGVHKLKYXIMC-KTJDEMTHSA-N
Data  1 KI
  Tab Delimited (TSV)   2D SDfile   Computed 3D by Vconf -m prep SDfile
Find this compound or compounds like it in BindingDB:
Activity Spreadsheet -- Enzyme Inhibition Constant Data from BindingDB
Found 1 hit for monomerid = 4695
TargetDimer of Gag-Pol polyprotein [489-587](Human immunodeficiency virus type 1)
Glaxosmithkline
LigandPNGBDBM4695((3R,3aS,6aR)-hexahydrofuro[2,3-b]furan-3-yl N-[(2S...)
Affinity DataKi:  0.000160nM ΔG°:  -17.7kcal/molepH: 5.5 T: 2°C. Assay description: The method was a competitive displacement assay used to determine binding affinities of other inhibitors relative to that of GW0385. The inhibitor of...
In DepthDetails ArticlePubMed