BDBM474531 US10882838, Example 1.3
SMILES CC1=CC[C@H]2[C@@H](C1)c1c(O)cc(cc1OC2(C)C)C(C)(C)C(=O)OCCCCC#N
InChI Key InChIKey=RTMUDYKVYDHMOF-MOPGFXCFSA-N
Data  3 KI
  Tab Delimited (TSV)   2D SDfile   Computed 3D by Vconf -m prep SDfile
Find this compound or compounds like it in BindingDB:
Activity Spreadsheet -- Enzyme Inhibition Constant Data from BindingDB
Found 3 hits for monomerid = 474531
TargetCannabinoid receptor 2(MOUSE)
Northeastern University
US Patent
LigandPNGBDBM474531(US10882838, Example 1.3)
Affinity DataKi:  0.5nM. Assay description: All the cannabinoids discussed in this invention are tested for their ability to bind to CB1 and CB2 receptors using membranes from rat brain or HEK2...
Ligand InfoPC cidPC sid
In DepthDetails US Patent
TargetCannabinoid receptor 1(Rattus norvegicus (rat))
Northeastern University
US Patent
LigandPNGBDBM474531(US10882838, Example 1.3)
Affinity DataKi:  0.700nM. Assay description: All the cannabinoids discussed in this invention are tested for their ability to bind to CB1 and CB2 receptors using membranes from rat brain or HEK2...
Ligand InfoPC cidPC sid
In DepthDetails US Patent
TargetCannabinoid receptor 2(Homo sapiens (Human))
Northeastern University
US Patent
LigandPNGBDBM474531(US10882838, Example 1.3)
Affinity DataKi:  0.800nM. Assay description: All the cannabinoids discussed in this invention are tested for their ability to bind to CB1 and CB2 receptors using membranes from rat brain or HEK2...
Ligand InfoPC cidPC sid
In DepthDetails US Patent