BDBM480924 US10906888, Example 138
SMILES O=C(N1CC2(C1)CCOCC2)c1cnc(NC2(CCC2)c2cnccn2)nc1
InChI Key InChIKey=AJJCUPNXKDDEQO-UHFFFAOYSA-N
Data  2 IC50
  Tab Delimited (TSV)   2D SDfile   Computed 3D by Vconf -m prep SDfile
Find this compound or compounds like it in BindingDB:
Activity Spreadsheet -- Enzyme Inhibition Constant Data from BindingDB
Found 2 hits for monomerid = 480924
TargetPantetheinase(Homo sapiens (Human))
Pfizer
Curated by ChEMBL
LigandPNGBDBM480924(US10906888, Example 138)
Affinity DataIC50:  0.0400nM. Assay description: Inhibition of recombinant N-terminal FLAG/His6-tagged human vanin-1 expressed in CHO cells using Pantetheine-7-amino-4-trifluoromethykournarin as sub...
Ligand InfoPC cidPC sid
In DepthDetails ArticlePubMed
TargetPantetheinase(Homo sapiens (Human))
Pfizer
Curated by ChEMBL
LigandPNGBDBM480924(US10906888, Example 138)
Affinity DataIC50:  0.0430nM. Assay description: The test inhibitors were solubilized in DMSO to a stock concentration of 30 mM. On the day of the assay, dose response plates were prepared by diluti...
Ligand InfoPC cidPC sid
In DepthDetails US Patent