BDBM489985 US10966980, Example 239
SMILES CN([C@@H]1C[C@H](CS(=O)(=O)C2CC(F)(F)C2)C1)c1ncnc2[nH]ccc12
InChI Key
Data  4 IC50
  Tab Delimited (TSV)   2D SDfile   Computed 3D by Vconf -m prep SDfile
Find this compound or compounds like it in BindingDB:
Activity Spreadsheet -- Enzyme Inhibition Constant Data from BindingDB
Found 4 hits for monomerid = 489985
TargetTyrosine-protein kinase JAK1(Homo sapiens (Human))
Pfizer
US Patent
LigandPNGBDBM489985(US10966980, Example 239)
Affinity DataIC50:  0.00300nM. Assay description: Test article and assay controls were added to a 384-well plate. Reaction mixtures contained 20 mM HEPES, pH 7.4, 10 mM magnesium chloride, 0.01% bovi...
Ligand InfoPC cidPC sid
In DepthDetails US Patent
TargetNon-receptor tyrosine-protein kinase TYK2(Homo sapiens (Human))
Pfizer
US Patent
LigandPNGBDBM489985(US10966980, Example 239)
Affinity DataIC50:  0.185nM. Assay description: Test article and assay controls were added to a 384-well plate. Reaction mixtures contained 20 mM HEPES, pH 7.4, 10 mM magnesium chloride, 0.01% bovi...
Ligand InfoPC cidPC sid
In DepthDetails US Patent
TargetTyrosine-protein kinase JAK3(Homo sapiens (Human))
Pfizer
US Patent
LigandPNGBDBM489985(US10966980, Example 239)
Affinity DataIC50:  5.70nM. Assay description: Test article and assay controls were added to a 384-well plate. Reaction mixtures contained 20 mM HEPES, pH 7.4, 10 mM magnesium chloride, 0.01% bovi...
Ligand InfoPC cidPC sid
In DepthDetails US Patent
TargetTyrosine-protein kinase JAK2(Homo sapiens (Human))
Pfizer
US Patent
LigandPNGBDBM489985(US10966980, Example 239)
Affinity DataIC50:  0.0700nM. Assay description: Test article and assay controls were added to a 384-well plate. Reaction mixtures contained 20 mM HEPES, pH 7.4, 10 mM magnesium chloride, 0.01% bovi...
Ligand InfoPC cidPC sid
In DepthDetails US Patent