BDBM498723 (1S,3R)-3-(3-{[(6- methylpyridin-3- yl)acetyl]amino}-1H-pyrazol-5- yl)cyclopentyl (trans-4- hydroxycyclohexyl)carbamate::US11014911, Example 548::US11718603, Example 548
SMILES Cc1ccc(CC(=O)Nc2cc([nH]n2)[C@@H]2CC[C@@H](C2)OC(=O)N[C@H]2CC[C@H](O)CC2)cn1
InChI Key
Data  4 KI
  Tab Delimited (TSV)   2D SDfile   Computed 3D by Vconf -m prep SDfile
Find this compound or compounds like it in BindingDB:
Activity Spreadsheet -- Enzyme Inhibition Constant Data from BindingDB
Found 4 hits for monomerid = 498723
TargetCyclin-dependent kinase 2/G1/S-specific cyclin-E1(Homo sapiens (Human))
Pfizer
US Patent
LigandPNGBDBM498723((1S,3R)-3-(3-{[(6- methylpyridin-3- yl)acetyl]am...)
Affinity DataKi:  0.390nM. Assay description: The purpose of CDK2/Cyclin E1 assay is to evaluate the inhibition (% inhibition, Kiapp and Ki values) of small molecule inhibitors by using a fluores...
Ligand InfoPC cidPC sid
In DepthDetails US Patent
TargetCyclin-dependent kinase 2/G1/S-specific cyclin-E1(Homo sapiens (Human))
Pfizer
US Patent
LigandPNGBDBM498723((1S,3R)-3-(3-{[(6- methylpyridin-3- yl)acetyl]am...)
Affinity DataKi:  0.390nM. Assay description: The purpose of CDK2/Cyclin E1 assay is to evaluate the inhibition (% inhibition, Kiapp and Ki values) of small molecule inhibitors by using a fluores...
Ligand InfoPC cidPC sid
In DepthDetails US Patent
TargetGlycogen synthase kinase-3 beta(Homo sapiens (Human))
Pfizer
US Patent
LigandPNGBDBM498723((1S,3R)-3-(3-{[(6- methylpyridin-3- yl)acetyl]am...)
Affinity DataKi:  2.10nM. Assay description: The purpose of GSK3β assay is to evaluate the inhibition (% inhibition, Kiapp and Ki values) of small molecule inhibitors by using a fluorescenc...
Ligand InfoPC cidPC sid
In DepthDetails US Patent
TargetGlycogen synthase kinase-3 beta(Homo sapiens (Human))
Pfizer
US Patent
LigandPNGBDBM498723((1S,3R)-3-(3-{[(6- methylpyridin-3- yl)acetyl]am...)
Affinity DataKi:  2.10nM. Assay description: The purpose of GSK3β assay is to evaluate the inhibition (% inhibition, Kiapp and Ki values) of small molecule inhibitors by using a fluorescenc...
Ligand InfoPC cidPC sid
In DepthDetails US Patent