BDBM50010435 Butyric acid 1'-butyryloxy-8,8'-dicyano-6,7,6',7'-tetrahydroxy-5,5'-diisopropyl-3,3'-dimethyl-[2,2']binaphthalenyl-1-yl ester::CHEMBL52792
SMILES CCCC(=O)Oc1c(c(C)cc2c(C(C)C)c(O)c(O)c(C#N)c12)-c1c(C)cc2c(C(C)C)c(O)c(O)c(C#N)c2c1OC(=O)CCC
InChI Key InChIKey=MJGLZUQZRBWJLM-UHFFFAOYSA-N
Data  1 KI
  Tab Delimited (TSV)   2D SDfile   Computed 3D by Vconf -m prep SDfile
Find this compound or compounds like it in BindingDB:
Activity Spreadsheet -- Enzyme Inhibition Constant Data from BindingDB
Found 1 hit for monomerid = 50010435
TargetAldo-keto reductase family 1 member B1(Homo sapiens (Human))
University Of New Mexico School Of Medicine
Curated by ChEMBL
LigandPNGBDBM50010435(Butyric acid 1'-butyryloxy-8,8'-dicyano-6,7,6',7'-...)
Affinity DataKi:  5.30E+3nM. Assay description: The compound was tested for inhibitory activity against aldose reductase from human placenta
In DepthDetails ArticlePubMed