BDBM50032938 2-{2-[(S)-2-(3-Benzyl-5-{1-[(1-carboxy-ethyl)-methyl-amino]-ethyl}-2-oxo-2,3,6,7-tetrahydro-azepin-1-yl)-propionylamino]-3-methyl-butyrylamino}-3-methyl-butyric acid methyl ester::CHEMBL446155
SMILES COC(=O)C(NC(=O)C(NC(=O)[C@H](C)N1CCC(=CC(Cc2ccccc2)C1=O)C(C)N(C)C(C)C(O)=O)C(C)C)C(C)C
InChI Key InChIKey=DDSIYDWYAAAWPY-QYKSTKLZSA-N
Data  1 KI
  Tab Delimited (TSV)   2D SDfile   Computed 3D by Vconf -m prep SDfile
Find this compound or compounds like it in BindingDB:
Activity Spreadsheet -- Enzyme Inhibition Constant Data from BindingDB
Found 1 hit for monomerid = 50032938
TargetGag-Pol polyprotein [489-587](Human immunodeficiency virus type 1)
Smithkline Beecham Pharmaceuticals
Curated by ChEMBL
LigandPNGBDBM50032938(2-{2-[(S)-2-(3-Benzyl-5-{1-[(1-carboxy-ethyl)-meth...)
Affinity DataKi:  1.47E+5nM. Assay description: Competitive inhibitory activity of the compound was determined against HIV-1 protease
In DepthDetails ArticlePubMed