BDBM50037127 CHEMBL104285::[(1S,2S,4R)-4-(5-Acetyl-1H-imidazol-2-yl)-1-benzyl-2-hydroxy-5-phenyl-pentyl]-carbamic acid tert-butyl ester
SMILES CC(=O)c1cnc([nH]1)[C@@H](C[C@H](O)[C@H](Cc1ccccc1)NC(=O)OC(C)(C)C)Cc1ccccc1
InChI Key InChIKey=XMMAYOOSKOYKKV-CUYJMHBOSA-N
Data  1 KI
  Tab Delimited (TSV)   2D SDfile   Computed 3D by Vconf -m prep SDfile
Find this compound or compounds like it in BindingDB:
Activity Spreadsheet -- Enzyme Inhibition Constant Data from BindingDB
Found 1 hit for monomerid = 50037127
TargetGag-Pol polyprotein [489-587](Human immunodeficiency virus type 1)
Smithkline Beecham Pharmaceuticals
Curated by ChEMBL
LigandPNGBDBM50037127(CHEMBL104285 | [(1S,2S,4R)-4-(5-Acetyl-1H-imidazol...)
Affinity DataKi:  370nM. Assay description: Apparent inhibition constant against recombinant HIV-1 protease
In DepthDetails ArticlePubMed