BDBM50071109 CHEMBL3409982
SMILES O=c1[nH]c(cs1)-c1cccc(c1)S(=O)(=O)NC1CCCC1
InChI Key InChIKey=YNSRHWKJAMIAPD-UHFFFAOYSA-N
Data  1 IC50
PDB links: 1 PDB ID matches this monomer.
  Tab Delimited (TSV)   2D SDfile   Computed 3D by Vconf -m prep SDfile
Find this compound or compounds like it in BindingDB:
Activity Spreadsheet -- Enzyme Inhibition Constant Data from BindingDB
Found 1 hit for monomerid = 50071109
TargetBromodomain-containing protein 4(Homo sapiens (Human))
Shanghai Institute Of Materia Medica
Curated by ChEMBL
LigandPNGBDBM50071109(CHEMBL3409982)
Affinity DataIC50:  1.40E+3nM. Assay description: Inhibition of BRD4(1) (unknown origin) incubated for 4 hrs by (+)-JQ1 fluorescent ligand based fluorescence anisotrophy