BDBM50073913 CHEMBL73003::{4-[(S)-2-Acetylamino-2-(1-{(S)-2-carbamoyl-1-[3-(5-hydroxy-indol-1-yl)-propylcarbamoyl]-ethylcarbamoyl}-cyclohexylcarbamoyl)-ethyl]-benzyl}-phosphonic acid
SMILES CC(=O)N[C@@H](Cc1ccc(CP(O)(O)=O)cc1)C(=O)NC1(CCCCC1)C(=O)N[C@@H](CC(N)=O)C(=O)NCCCn1ccc2cc(O)ccc12
InChI Key InChIKey=KTEIKJDTMFXKOP-NSOVKSMOSA-N
Data  1 IC50
  Tab Delimited (TSV)   2D SDfile   Computed 3D by Vconf -m prep SDfile
Find this compound or compounds like it in BindingDB:
Activity Spreadsheet -- Enzyme Inhibition Constant Data from BindingDB
Found 1 hit for monomerid = 50073913
TargetGrowth factor receptor-bound protein 2(Homo sapiens (Human))
Novartis Pharma
Curated by ChEMBL
LigandPNGBDBM50073913(CHEMBL73003 | {4-[(S)-2-Acetylamino-2-(1-{(S)-2-ca...)
Affinity DataIC50:  0.300nM. Assay description: Inhibition of Grb-SH2 domain binding to phosphorylated carboxy-terminal intracellular domain of epidermal growth factor receptor
In DepthDetails ArticlePubMed