BDBM50075355 4-[8-(4-tert-Butyl-phenyl)-5,5-dimethyl-5,6-dihydro-naphthalen-2-ylethynyl]-benzoic acid::CHEMBL423954
SMILES CC(C)(C)c1ccc(cc1)C1=CCC(C)(C)c2ccc(cc12)C#Cc1ccc(cc1)C(O)=O
InChI Key InChIKey=WIZHKNTXIRSNRK-UHFFFAOYSA-N
Data  3 Kd
  Tab Delimited (TSV)   2D SDfile   Computed 3D by Vconf -m prep SDfile
Find this compound or compounds like it in BindingDB:
Activity Spreadsheet -- Enzyme Inhibition Constant Data from BindingDB
Found 3 hits for monomerid = 50075355
TargetRetinoic acid receptor beta(Homo sapiens (Human))
Allergan
Curated by ChEMBL
LigandPNGBDBM50075355(4-[8-(4-tert-Butyl-phenyl)-5,5-dimethyl-5,6-dihydr...)
Affinity DataKd:  21nM. Assay description: Ability to displace 3[H]-(all-E)-retinoic acid (5 nM) from beta retinoic acid receptor (beta RAR) using transactivation assay
In DepthDetails ArticlePubMed
TargetRetinoic acid receptor alpha(Homo sapiens (Human))
Allergan
Curated by ChEMBL
LigandPNGBDBM50075355(4-[8-(4-tert-Butyl-phenyl)-5,5-dimethyl-5,6-dihydr...)
Affinity DataKd:  178nM. Assay description: Ability to displace 3[H]-(all-E)-retinoic acid (5 nM) from alpha retinoic acid receptor (alpha RAR) using transactivation assay
In DepthDetails ArticlePubMed
TargetRetinoic acid receptor gamma(Homo sapiens (Human))
Allergan
Curated by ChEMBL
LigandPNGBDBM50075355(4-[8-(4-tert-Butyl-phenyl)-5,5-dimethyl-5,6-dihydr...)
Affinity DataKd:  94nM. Assay description: Ability to displace 3[H]-(all-E)-retinoic acid (5 nM) from Retinoic acid receptor gamma using transactivation assay
In DepthDetails ArticlePubMed