BDBM50078632 CHEMBL4751992
SMILES Cc1cn(CCn2cnc(c2-c2ccc(cc2)C#N)-c2ccccc2)nn1
InChI Key InChIKey=OAPIWVHFYSEARE-UHFFFAOYSA-N
Data  1 EC50
PDB links: 1 PDB ID matches this monomer.
  Tab Delimited (TSV)   2D SDfile   Computed 3D by Vconf -m prep SDfile
Find this compound or compounds like it in BindingDB:
Activity Spreadsheet -- Enzyme Inhibition Constant Data from BindingDB
Found 1 hit for monomerid = 50078632
TargetMetabotropic glutamate receptor 4(Homo sapiens (Human))
Vanderbilt University
Curated by ChEMBL
LigandPNGBDBM50078632(CHEMBL4751992)
Affinity DataEC50:  1.69E+3nM. Assay description: Evaluated for the percent binding affinity against H1 receptor by an H1 histamine-mediated bronchospasm
In DepthDetails ArticlePubMed