BDBM50080525 1,4,4,7-Tetramethyl-1,2,3,4-tetrahydro-quinoline-6-carboxylic acid 4-ethoxycarbonyl-phenyl ester::CHEMBL331642
SMILES CCOC(=O)c1ccc(OC(=O)c2cc3c(cc2C)N(C)CCC3(C)C)cc1
InChI Key InChIKey=NHPSIGTUSHGWRX-UHFFFAOYSA-N
Data  4 EC50
  Tab Delimited (TSV)   2D SDfile   Computed 3D by Vconf -m prep SDfile
Find this compound or compounds like it in BindingDB:
Activity Spreadsheet -- Enzyme Inhibition Constant Data from BindingDB
Found 4 hits for monomerid = 50080525
TargetRetinoic acid receptor RXR-beta(Mus musculus)
University Of Oklahoma Health Sciences Center
Curated by ChEMBL
LigandPNGBDBM50080525(1,4,4,7-Tetramethyl-1,2,3,4-tetrahydro-quinoline-6...)
Affinity DataEC50:  70nM. Assay description: Transcriptional activation in CV-1 cells expressing Retinoid X receptor RXR beta
In DepthDetails ArticlePubMed
TargetRetinoic acid receptor beta(Homo sapiens (Human))
University Of Oklahoma Health Sciences Center
Curated by ChEMBL
LigandPNGBDBM50080525(1,4,4,7-Tetramethyl-1,2,3,4-tetrahydro-quinoline-6...)
Affinity DataEC50:  92nM. Assay description: Transcriptional activation in CV-1 cells expressing Retinoic acid receptor RAR beta
In DepthDetails ArticlePubMed
TargetRetinoic acid receptor RXR-gamma(Mus musculus)
University Of Oklahoma Health Sciences Center
Curated by ChEMBL
LigandPNGBDBM50080525(1,4,4,7-Tetramethyl-1,2,3,4-tetrahydro-quinoline-6...)
Affinity DataEC50:  49nM. Assay description: Transcriptional activation in CV-1 cells expressing Retinoid X receptor RXR gamma
In DepthDetails ArticlePubMed
TargetRetinoic acid receptor alpha(Homo sapiens (Human))
University Of Oklahoma Health Sciences Center
Curated by ChEMBL
LigandPNGBDBM50080525(1,4,4,7-Tetramethyl-1,2,3,4-tetrahydro-quinoline-6...)
Affinity DataEC50:  796nM. Assay description: Transcriptional activation in CV-1 cells expressing human Retinoic acid receptor alpha
In DepthDetails ArticlePubMed